{"text_format":"1","workbook":"xlsx","n_sheets":7,"sheets":["Navigation Pane","General Input Sheet","Exist Trunk Assets - LFCF1","Exist Trunk Assets - LFCF","Future Trunk Assets - LFCF","Catchment Demand -LFCF","Summary Cost Schedule"],"not_rendered":{"charts":0,"images":0,"macros":1,"external_links":0,"defined_names":31,"comments":0,"pivot_tables":0},"unopened":[],"bounds":{"document_bytes":16777216,"sheet_cells":100000,"rows_first":2000,"rows_last":500,"rows_between":2000,"halvings":0,"cell_chars":16384,"cell_head_chars":4096},"cells_cut":0,"cells_raw":0,"read":"whole","date_system":"1900"}

{"sheet":"Navigation Pane","index":0,"n_rows":21,"n_cols":18,"rows_kept":21,"cut":false,"hidden":false,"merged":[[17,2,17,5],[14,12,14,15],[22,2,22,5],[21,2,21,5],[18,2,18,5],[20,2,20,5],[1,1,1,15],[2,1,2,15],[3,5,3,6],[11,7,11,10],[12,7,22,10],[11,12,11,15],[9,3,9,4],[9,8,9,9],[9,13,9,14],[11,2,11,5],[12,2,12,5],[14,2,14,5],[15,2,15,5],[12,12,12,15],[7,3,8,15],[15,12,15,15]]}
[]
[null,"Brisbane City Council"]
[null,"Local Government Infrastructure Plan (LGIP)"]
[]
[]
[null,"Version No",null,1,null,"Date","2021-12-10",null,null,"Author ","BCC",null,null,null,null,null," "]
[]
[null,"Comments",null,"Version for LGIP Amendment 1a adoption. Effective as at 10 December 2021."]
[]
[null,null,null,"Inputs",null,null,null,null,"Calculation",null,null,null,null,"Outputs"]
[]
[null,null,"General Input Sheet",null,null,null,null,"Calculation Function",null,null,null,null,"Summary Cost Schedule",null,null,null,null," "]
[null,null,"l Financial Inputs\nl Other \"generic\" inputs",null,null,null,null,"Catchment based summary of demand, infrastructure (existing and new) and cost allocation\n\nInfrastructure Cost calculation for each catchment\n\nOptional Discounted Cashflow",null,null,null,null,"l Summary of demand and cost allocation by catchment \nl Final costs by catchment",null,null,null,null," "]
[]
[null,null,null,null,null,null,null,null,null,null,null,null,"Summary Cash flow Projections"]
{"$rows_left_out":7}
{"sheet":"General Input Sheet","index":1,"n_rows":51,"n_cols":9,"rows_kept":51,"cut":false,"hidden":false,"merged":[[1,1,1,11],[3,1,3,10],[24,1,29,1],[20,1,22,1],[5,1,5,2],[15,1,15,2],[11,1,11,2]]}
[]
[null,{"$f":"'Navigation Pane'!B2","v":"Brisbane City Council"}]
["Return to Navigation Pane"]
[null,"General Input Sheet"]
[]
[null,"General Inputs",null,null,"Reference",null,"Value",null,"Comments"]
[]
[null,null,"Base Year",null,"YEAR",null,2016]
[null,null,null,null,null,null,{"$f":"YEAR","v":2016}]
[null,null,"Term (between 15 and 30 years)",null,"TERM",null,10]
[]
[null,"Application of Discounted Cash flow"]
[null,null," "]
[null,null,"Calculate charges using Discounted Cash flow? (Y/N)",null,"DCFTRIGGER",null,"Yes"]
[]
{"$rows_left_out":37}
{"sheet":"Exist Trunk Assets - LFCF1","index":2,"n_rows":443,"n_cols":34,"rows_kept":443,"cut":false,"hidden":false,"merged":[[8,22,9,22],[8,31,9,31],[8,32,9,32],[8,33,9,33],[8,23,9,23],[8,24,9,24],[8,25,9,25],[8,26,9,26],[8,27,9,27],[8,29,9,29],[8,30,9,30],[0,1,0,12],[1,1,1,12],[5,1,5,2],[7,16,7,20],[8,1,8,5],[8,6,8,7],[8,10,8,12],[8,13,8,15],[8,16,9,16],[8,17,9,17],[8,18,9,18],[8,19,9,19],[8,20,9,20],[3,1,3,12],[8,8,8,9]]}
[null,{"$f":"'Navigation Pane'!B2","v":"Brisbane City Council"}]
[null,"Land for Community Facilities"]
["Return to \"Existing Trunk Assets\""]
[null,"EXISTING TRUNK ASSETS"]
[]
[null,"Land Valuation Type",null,"Location"]
[]
[null,null,null,null,null,null,null,"Asset Data",null,null,null,null,null,null,null,null,"Catchment Asset Allocation",null,null,null,null,null,null,"Asset Usage",null,null,null,null,null,null,"Cost Allocation"]
[null,"Basic Asset Data",null,null,null,null,"Asset Attributes",null,"Basic Asset Valuation",null,null,null,null,"Refined Asset Value",null,null,"Fringe","Urban East","Urban North","Urban South","Urban West",null,{"$f":"Q9","v":"Fringe"},{"$f":"R9","v":"Urban East"},{"$f":"S9","v":"Urban North"},{"$f":"T9","v":"Urban South"},{"$f":"U9","v":"Urban West"},"TOTALS",null,{"$f":"Q9","v":"Fringe"},{"$f":"R9","v":"Urban East"},{"$f":"S9","v":"Urban North"},{"$f":"T9","v":"Urban South"},{"$f":"U9","v":"Urban West"}]
[null,"Asset ID","LGIP ID","Asset Class","Sector","Description","Utility allowance ($56,000/site)","Area size (*)","Unit Rate","Baseline Valuation","Size of land (m2) (*)","Unit Cost","Land Value","Valuation Year","Escalation","Current Repalcement Cost","Fringe","Urban East","Urban North","Urban South","Urban West"]
[null,null,null,null,null,null,null,null,null,null,null,null,null,null,null,null,1,{"$f":"Q11+1","v":2},{"$f":"R11+1","v":3},4,5]
[null,"Councils ID (from GIS, FAR, AMA etc.)","ID from the LGIP drawings","Local/District",null,null,null,null,null,"May be calculated from unit rates OR unique values can be direct entered",null,null,null,null,null,null,{"$f":"IFERROR(VLOOKUP(Q9,Parkscatch,6,FALSE),\"\")","v":21425},306014,456561,459171,261614,null,null,null,null,null,null,null,null,{"$f":"SUM(AD13:AD442)","v":1261148.6019610667},{"$f":"SUM(AE13:AE442)","v":25108337.221522268},{"$f":"SUM(AF13:AF442)","v":29880573.405877955},{"$f":"SUM(AG13:AG442)","v":28096236.403171379},{"$f":"SUM(AH13:AH399)","v":23564816.414409414}]
[null,"1,CP890177",null,"Local","Urban West","COUNCIL LAND BRISB-004/0170-4 ^01186 ",null,null,{"$f":"IFERROR((J13-G13)/H13,0)","v":0},null,3755.9630817367001,{"$f":"IFERROR(M13/K13,0)","v":121.61225231979543},456771.13,2016,{"$f":"IFERROR(('General Input Sheet'!$G$38/(VLOOKUP(N13,'General Input Sheet'!$E$38:$G$44,3,FALSE))),1)","v":1},{"$f":"J13+M13","v":456771.13},{"$f":"IF(OR(Q$9=$E13,$D13=\"Metropolitan\",$D13=\"District\"),\"y\",\"\")","v":""},{"$f":"IF(OR(R$9=$E13,$D13=\"Metropolitan\"),\"y\",\"\")","v":""},"","","y",null,{"$f":"_xlfn.IFS(AND(Q13=\"y\",$D13=\"Local\"), 1, AND(Q13=\"y\",$D13<>\"Local\"),1.49009696454663%, Q13=\"\",\"\")","v":""},{"$f":"_xlfn.IFS(AND(R13=\"y\",$D13=\"Local\"), 1, AND(R13=\"y\",$D13<>\"Local\"),20.7557554582461%, R13=\"\",\"\")","v":""},{"$f":"_xlfn.IFS(AND(S13=\"y\",$D13=\"Local\"), 1, AND(S13=\"y\",$D13<>\"Local\"),30.3499104327336%, S13=\"\",\"\")","v":""},{"$f":"_xlfn.IFS(AND(T13=\"y\",$D13=\"Local\"), 1, AND(T13=\"y\",$D13<>\"Local\"),29.0043833288201%, T13=\"\",\"\")","v":""},{"$f":"_xlfn.IFS(AND(U13=\"y\",$D13=\"Local\"), 1, AND(U13=\"y\",$D13<>\"Local\"),18.3998538156536%, U13=\"\",\"\")","v":1},{"$f":"SUM(W13:AA13)","v":1},null,{"$f":"IF(W13=\"\",\"\",(W13/$AB13)*$P13)","v":""},{"$f":"IF(X13=\"\",\"\",(X13/$AB13)*$P13)","v":""},{"$f":"IF(Y13=\"\",\"\",(Y13/$AB13)*$P13)","v":""},{"$f":"IF(Z13=\"\",\"\",(Z13/$AB13)*$P13)","v":""},{"$f":"IF(AA13=\"\",\"\",(AA13/$AB13)*$P13)","v":456771.13}]
[null,"1,RP101654",null,"District","Urban South","COUNCIL LAND BRISB-000/0039   ^02056 ",null,null,{"$f":"IFERROR((J14-G14)/H14,0)","v":0},null,1953.75274429705,{"$f":"IFERROR(M14/K14,0)","v":124.49695628579406},243236.27,2016,{"$f":"IFERROR(('General Input Sheet'!$G$38/(VLOOKUP(N14,'General Input Sheet'!$E$38:$G$44,3,FALSE))),1)","v":1},243236.27,{"$f":"IF(OR(Q$9=$E14,$D14=\"Metropolitan\",$D14=\"District\"),\"y\",\"\")","v":"y"},"y","y","y","y",null,{"$f":"_xlfn.IFS(AND(Q14=\"y\",$D14=\"Local\"), 1, AND(Q14=\"y\",$D14<>\"Local\"),1.49009696454663%, Q14=\"\",\"\")","v":1.49009696454663E-2},{"$f":"_xlfn.IFS(AND(R14=\"y\",$D14=\"Local\"), 1, AND(R14=\"y\",$D14<>\"Local\"),20.7557554582461%, R14=\"\",\"\")","v":0.207557554582461},{"$f":"_xlfn.IFS(AND(S14=\"y\",$D14=\"Local\"), 1, AND(S14=\"y\",$D14<>\"Local\"),30.3499104327336%, S14=\"\",\"\")","v":0.30349910432733601},{"$f":"_xlfn.IFS(AND(T14=\"y\",$D14=\"Local\"), 1, AND(T14=\"y\",$D14<>\"Local\"),29.0043833288201%, T14=\"\",\"\")","v":0.29004383328820099},{"$f":"_xlfn.IFS(AND(U14=\"y\",$D14=\"Local\"), 1, AND(U14=\"y\",$D14<>\"Local\"),18.3998538156536%, U14=\"\",\"\")","v":0.183998538156536},1.0000000000000004,null,3624.4562759464434,50485.525386959198,73821.990084922043,70549.180145523816,44755.118106648471]
[null,"1,RP103015",null,"District","Urban North","COUNCIL LAND BRISB-000/0555   ^09168 ",null,null,0,null,721.59588742660605,{"$f":"IFERROR(M15/K15,0)","v":445.67881497621494},321600,2016,{"$f":"IFERROR(('General Input Sheet'!$G$38/(VLOOKUP(N15,'General Input Sheet'!$E$38:$G$44,3,FALSE))),1)","v":1},321600,"y","y","y","y","y",null,{"$f":"_xlfn.IFS(AND(Q15=\"y\",$D15=\"Local\"), 1, AND(Q15=\"y\",$D15<>\"Local\"),1.49009696454663%, Q15=\"\",\"\")","v":1.49009696454663E-2},{"$f":"_xlfn.IFS(AND(R15=\"y\",$D15=\"Local\"), 1, AND(R15=\"y\",$D15<>\"Local\"),20.7557554582461%, R15=\"\",\"\")","v":0.207557554582461},{"$f":"_xlfn.IFS(AND(S15=\"y\",$D15=\"Local\"), 1, AND(S15=\"y\",$D15<>\"Local\"),30.3499104327336%, S15=\"\",\"\")","v":0.30349910432733601},{"$f":"_xlfn.IFS(AND(T15=\"y\",$D15=\"Local\"), 1, AND(T15=\"y\",$D15<>\"Local\"),29.0043833288201%, T15=\"\",\"\")","v":0.29004383328820099},{"$f":"_xlfn.IFS(AND(U15=\"y\",$D15=\"Local\"), 1, AND(U15=\"y\",$D15<>\"Local\"),18.3998538156536%, U15=\"\",\"\")","v":0.183998538156536},1.0000000000000004,null,4792.1518379819599,66750.509553719428,97605.311951671232,93278.09678548541,59173.929871141947]
{"$rows_left_out":429}
{"sheet":"Exist Trunk Assets - LFCF","index":3,"n_rows":17,"n_cols":7,"rows_kept":17,"cut":false,"hidden":false,"merged":[[6,2,6,3],[6,4,6,5]]}
[null,{"$f":"'Navigation Pane'!B2","v":"Brisbane City Council"}]
[null,"Parks and Land for Community Facilities"]
["Return to \"Future Trunk Assets\""]
[null,"Existing Trunk Assets"]
[]
[]
[null,null,"Local (single catchment servicing)",null,"District/Metropolitan (Brisbane wide)",null,"Total Current Repalcement Cost"]
[null,"Catchment","Land","Construction","Land","Construction","Land and Construction"]
[null,"Fringe",7927,0,17797,355940,{"$f":"SUM(C9:F9)","v":381664}]
[null,"Urban East",6874190,2198485,9628618,3153020,{"$f":"SUM(C10:F10)","v":21854313}]
[null,"Urban North",5049181,1383395,22117308,10722695,39272579]
[null,"Urban South",3919633,1768145,11211249,2872780,19771807]
[null,"Urban West",9426861,1112360,12545867,4567085,27652173]
[]
[]
{"$rows_left_out":3}
{"sheet":"Future Trunk Assets - LFCF","index":4,"n_rows":22,"n_cols":56,"rows_kept":22,"cut":false,"hidden":false,"merged":[[11,1,11,5],[11,6,11,9],[11,10,11,17],[11,19,11,28],[10,50,10,55],[11,55,12,55],[11,50,12,50],[11,51,12,51],[11,52,12,52],[11,53,12,53],[11,54,12,54],[11,35,12,35],[11,30,12,30],[11,31,12,31],[11,32,12,32],[11,33,12,33],[11,34,12,34],[11,46,12,46],[11,47,12,47],[11,48,12,48],[11,37,12,37],[11,38,12,38],[11,39,12,39],[11,40,12,40],[11,41,12,41],[11,42,12,42],[11,44,12,44],[11,45,12,45],[1,1,1,9],[2,1,2,9],[4,1,4,9],[8,1,8,2],[10,30,10,35],[6,4,6,19],[6,1,6,3]]}
[]
[null,{"$f":"'Navigation Pane'!B2","v":"Brisbane City Council"}]
[null,"Parks and Land for Community Facilities"]
["Return to \"Future Trunk Assets\""]
[null,"Future Trunk Assets"]
[]
[null,"Data References",null,null,"1. Indirect embellishment costs are on costs or overheads applied to the direct embellishment cost, to deliver the project. Indirect embellishment costs equate to 17% of the direct embellishment cost.\n2. Project costs are on costs to undertake detailed design, survey, geotechnical investigations, project management, and supervision of construction works and obtain certification from a Registered Professional Engineer of Queensland. Project costs equate to 13% of the direct and indirect embellishment costs.\n3. Contingency costs are based on the project delivery date, and applied to the direct construction cost, indirect construction cost and project cost. Contingencies equate to 7.5% for projects with a delivery date up to 2021 and 15% for projects with a delivery date up to 2026.\n4. Total embellishment cost is the sum of direct embellishment cost, indirect embellishment cost, project cost and construction contingency cost. \n5. Terminal Value Adjustment is only applicable to items that have an estimated completion date between 2021 and 2026, items value exceeds 20% of the total network value in the same catchment and same year of provision, and items catchment has spare capacity greater than 30%."]
[]
[null,"Land Valuation Type",null,"Location"]
[]
[null,null,null,null,null,null,null,null,null,null,"Asset Data",null,null,null,null,null,null,null,null,null,null,null,null,null,null,null,null,null,null,null,"Catchment Asset Allocation",null,null,null,null,null,null,null,"Asset Usage",null,null,null,null,null,null,"Cost Allocation",null,null,null,null,"Cost Allocation for Service Cost Schedule"]
[null,"Basic Asset Data",null,null,null,null,"Land Cost Valuation",null,null,null,null,null,null,null,null,null,null,null,null,"Refined Asset Value",null,null,null,null,null,null,null,null,null,null,"Fringe","Urban East","Urban North","Urban South","Urban West",{"$f":"'Catchment Demand -LFCF'!$C38","v":"Totals"},null,{"$f":"AE12","v":"Fringe"},{"$f":"AF12","v":"Urban East"},{"$f":"AG12","v":"Urban North"},{"$f":"AH12","v":"Urban South"},{"$f":"AI12","v":"Urban West"},"TOTALS",null,{"$f":"AE12","v":"Fringe"},{"$f":"AF12","v":"Urban East"},{"$f":"AG12","v":"Urban North"},{"$f":"AH12","v":"Urban South"},{"$f":"AI12","v":"Urban West"},null,{"$f":"AE12","v":"Fringe"},{"$f":"AF12","v":"Urban East"},{"$f":"AG12","v":"Urban North"},{"$f":"AH12","v":"Urban South"},{"$f":"AI12","v":"Urban West"},{"$f":"AQ12","v":"TOTALS"}]
[null,"Asset ID","LGIP ID","Asset Class","Service Catchment","Description","Land Location/Type","Size of land (m2)","Unit Cost (m2)","Land Value","Site preparation and connection to services (direct construction) cost  ($)","Valuation Year","Indirect Cost Escalation %","Indirect Embellishment Costs","Multiplier","Contingency Cost %","Project Owners Cost %","Work Cost              (at Base Year)","Contingency Cost ($)","Year of Provision","Land Cost Escalation","Work Cost Escalation","Spare Capacity %","Share of the total Cost with the same year of provision %"," Terminal Value Analysis","Final Terminal value adjustment %","Total Assets Cost (at Base Year)","Total Asset Cost (escalated)","Net Present Value of Total Asset Cost","NPV Total Asset Cost after Terminal Value Adjustment","Fringe","Urban East","Urban North","Urban South","Urban West"]
[null,"Councils ID (from GIS, FAR, AMA etc.)","ID from the LGIP drawings","Local/District Park",null,null,null,null,null,null,null,null,null,null,null,null,null,null,null,null,null,null,"Applicable to project year of provision at 2024",null,null," % of cost which is relevant for Summary Cost Calculation",null,"Gross cost (used for CF forecasts)","Adjusted Current Day Value ","For Summary Cost Calculation",null,null,null,null,null,{"$f":"IFERROR(VLOOKUP(AJ12,Parkscatch,6,FALSE),\"\")","v":""},null,null,null,null,null,null,null,null,{"$f":"SUM(AS15:AS22)","v":354876.14362832252},4943116.2067737943,10685018.71248138,10209744.80785564,4382043.1292608613,null,{"$f":"SUM(AY15:AY22)","v":354876.14362832252},4943116.2067737943,10685018.71248138,9208230.4604596812,4382043.1292608613,{"$f":"SUM(BC15:BD22)","v":33955327.781864896}]
[null,"PCF72 ","CDE-CF-001","District","Urban North","Land acquisition, basic site preparation and connection to services to provide DISTRICT LIBRARY","Carseldine / Bracken Ridge",3000,{"$f":"J15/H15","v":200},600000,397633,2016,0.17,{"$f":"ROUND(K15*M15,0)","v":67598},1,{"$f":"IF(T15=\"\",\"\",IF(T15<=YEAR+5,0.075,IF(AND(T15>YEAR+5,T15<=YEAR+10),0.15,IF(AND(T15>YEAR+10,T15<=YEAR+20),0.2,IF(T15>YEAR+20,0.25,\"\")))))","v":7.4999999999999997E-2},{"$f":"ROUND((K15+N15)*13%,0)","v":60480},{"$f":"ROUND((K15+N15+Q15+(K15+N15+Q15)*P15),0)","v":565139},{"$f":"ROUND((K15+N15+Q15)*P15,0)","v":39428},2019,2.5000000000000001E-2,1.8700000000000001E-2,{"$f":"IFERROR(IF(FutureTrunkParks[[#This Row],[Year of Provision]]>2019,VLOOKUP(FutureTrunkParks[[#This Row],[Service Catchment]],'Catchment Demand -LFCF'!$C$8:$M$12,11,FALSE),\"\"),\"\")","v":""},{"$f":"_xlfn.IFS(FutureTrunkParks[[#This Row],[Year of Provision]]=2019,0,FutureTrunkParks[[#This Row],[Year of Provision]]=2024,FutureTrunkParks[[#This Row],[Total Assets Cost (at Base Year)]]/SUMIFS(AA$15:AA$21,T$15:T$21,\"2024\",E$15:E$21,FutureTrunkParks[[#This Row],[Service Catchment]]))","v":0},{"$f":"IF(AND(FutureTrunkParks[[#This Row],[Spare Capacity %]]>30%,FutureTrunkParks[[#This Row],[Share of the total Cost with the same year of provision %]]>20%),(1-FutureTrunkParks[[#This Row],[Spare Capacity %]]),1)","v":1},{"$f":"IF(FutureTrunkParks[[#This Row],[ Terminal Value Analysis]]<0,0,FutureTrunkParks[ [ Terminal Value Analysis] ])","v":1},{"$f":"ROUND((R15+J15),0)","v":1165139},{"$f":"ROUND((R15*(1+V15)^(T15-YEAR)+J15*(1+U15)^(T15-YEAR)),0)","v":1243574},{"$f":"ROUND((AB15*(1/(1+WACC))^(T15-YEAR)),0)","v":1046793},{"$f":"FutureTrunkParks[[#This Row],[Net Present Value of Total Asset Cost]]*FutureTrunkParks[[#This Row],[Final Terminal value adjustment %]]","v":1046793},{"$f":"IF(OR(AE$13=$E15,$D15=\"Metropolitan\",$D15=\"District\"),\"y\",\"\")","v":"y"},{"$f":"IF(OR(AF$13=$E15,$D15=\"Metropolitan\",$D15=\"District\"),\"y\",\"\")","v":"y"},"y","y","y",{"$f":"IF(OR(AJ$10=$E15,$D15=\"Metropolitan\",$D15=\"District\"),\"y\",\"\")","v":"y"},null,{"$f":"_xlfn.IFS(AND(AE15=\"y\",$D15=\"Local\"), 1, AND(AE15=\"y\",$D15<>\"Local\"),1.49009696454663%, AE15=\"\",\"\")","v":1.49009696454663E-2},{"$f":"_xlfn.IFS(AND(AF15=\"y\",$D15=\"Local\"), 1, AND(AF15=\"y\",$D15<>\"Local\"),20.7557554582461%, AF15=\"\",\"\")","v":0.207557554582461},{"$f":"_xlfn.IFS(AND(AG15=\"y\",$D15=\"Local\"), 1, AND(AG15=\"y\",$D15<>\"Local\"),30.3499104327336%, AG15=\"\",\"\")","v":0.30349910432733601},{"$f":"_xlfn.IFS(AND(AH15=\"y\",$D15=\"Local\"), 1, AND(AH15=\"y\",$D15<>\"Local\"),29.0043833288201%, AH15=\"\",\"\")","v":0.29004383328820099},{"$f":"_xlfn.IFS(AND(AI15=\"y\",$D15=\"Local\"), 1, AND(AI15=\"y\",$D15<>\"Local\"),18.3998538156536%, AI15=\"\",\"\")","v":0.183998538156536},{"$f":"SUM(AL15:AP15)","v":1.0000000000000004},null,{"$f":"IF(AL15=\"\",\"\",(AL15/$AQ15)*$AC15)","v":15598.230718086597},217269.795234038,317700.73791612493,303615.85437925567,192608.38175249469,null,{"$f":"IF(AL15=\"\",\"\",(AL15/$AQ15)*$AD15)","v":15598.230718086597},217269.795234038,317700.73791612493,303615.85437925567,192608.38175249469,{"$f":"SUM(AY15:BC15)","v":1046792.9999999999}]
{"$rows_left_out":8}
{"sheet":"Catchment Demand -LFCF","index":5,"n_rows":47,"n_cols":34,"rows_kept":47,"cut":false,"hidden":false,"merged":[[1,1,1,11],[2,1,2,11],[4,1,4,11]]}
[]
[null,{"$f":"'Navigation Pane'!B2","v":"Brisbane City Council"}]
[null,"Land for Community Facilities"]
["Return to \"Catchment Demand\""]
[null,"Catchment Demand(equivalent persons)"]
[]
[null,"Catchment No","Catchment Name (*)",2016,{"$f":"D7+5","v":2021},{"$f":"E7+5","v":2026},2031,2036,null,{"$f":"\"NPV Future Demand (\"&(D7+1)& \" - \" &H7+10&\")\"","v":"NPV Future Demand (2017 - 2046)"},null,{"$f":" \"Ultimate Demand\"","v":"Ultimate Demand"},"Spare Capacity"]
[null,1,"Fringe",18971,19762,20305,21481,21425,null,{"$f":"NPV(5.91%,E43:N43)","v":1012.1705305695717},null,22125,{"$f":"(L8-F8)/F8","v":8.9633095296724946E-2}]
[null,2,"Urban East",261140,269823,282831,291232,306014,null,{"$f":"NPV(5.91%,E44:N44)","v":15577.281233227377},null,347425,{"$f":"(L9-F9)/F9","v":0.22838373445626539}]
[null,3,"Urban North",364760,390211,413567,435381,456561,null,36296.82244691869,null,513297,0.24114593282346028]
[null,4,"Urban South",348928,374505,395232,429036,459171,null,34737.03994962381,null,515102,0.30329021941543194]
[null,5,"Urban West",242606,247828,250728,255513,261614,null,6248.1325137318499,null,284638,0.13524616317284069]
[]
[]
[]
{"$rows_left_out":33}
{"sheet":"Summary Cost Schedule","index":6,"n_rows":15,"n_cols":11,"rows_kept":15,"cut":false,"hidden":false,"merged":[[8,1,8,10],[1,1,1,9],[2,1,2,9],[4,1,4,9],[6,3,6,5],[6,6,6,8],[6,1,6,2],[6,10,7,10],[6,9,7,9]]}
[]
[null,{"$f":"'Navigation Pane'!B2","v":"Brisbane City Council"}]
[]
["Return to Navigation Pane"]
[null,"Summary Cost Schedule"]
[]
[null,"Catchment",null,"Demand",null,null,"Cost of Trunk Infrastrcutrue ",null,null,"Cost per Unit Demand (Average)","Cost per Unit Demand (Marginal)"]
[null,"No","Name","Existing (A)","NPV Future (B)","TOTAL (A)+ (B)","Existing (C)","NPV Future (D)","TOTAL (C)+ (D)"]
[null,"Land for Community Facilities"]
[null,{"$f":"'Catchment Demand -LFCF'!B43","v":1},{"$f":"'Catchment Demand -LFCF'!C43","v":"Fringe"},{"$f":"IFERROR(VLOOKUP($C10,'Catchment Demand -LFCF'!$C$8:$J$37,2,FALSE),\"\")","v":18971},{"$f":"IFERROR(VLOOKUP($C10,'Catchment Demand -LFCF'!$C$8:$J$37,8,FALSE),\"\")","v":1012.1705305695717},{"$f":"IFERROR(D10+E10,\"\")","v":19983.170530569572},1158168,{"$f":"HLOOKUP(C10,'Future Trunk Assets - LFCF'!$AY$12:$BC$14,3,FALSE)","v":354876.14362832252},{"$f":"G10+H10","v":1513044.1436283225},{"$f":"IFERROR(I10/F10,0)","v":75.71592011956858},{"$f":"H10/E10","v":350.60904552183069}]
[null,{"$f":"'Catchment Demand -LFCF'!B44","v":2},{"$f":"'Catchment Demand -LFCF'!C44","v":"Urban East"},{"$f":"IFERROR(VLOOKUP($C11,'Catchment Demand -LFCF'!$C$8:$J$37,2,FALSE),\"\")","v":261140},{"$f":"IFERROR(VLOOKUP($C11,'Catchment Demand -LFCF'!$C$8:$J$37,8,FALSE),\"\")","v":15577.281233227377},{"$f":"IFERROR(D11+E11,\"\")","v":276717.2812332274},25094533,{"$f":"HLOOKUP(C11,'Future Trunk Assets - LFCF'!$AY$12:$BC$14,3,FALSE)","v":4943116.2067737943},{"$f":"G11+H11","v":30037649.206773795},{"$f":"IFERROR(I11/F11,0)","v":108.54995782304239},{"$f":"H11/E11","v":317.32855899332412}]
[null,{"$f":"'Catchment Demand -LFCF'!B45","v":3},{"$f":"'Catchment Demand -LFCF'!C45","v":"Urban North"},{"$f":"IFERROR(VLOOKUP($C12,'Catchment Demand -LFCF'!$C$8:$J$37,2,FALSE),\"\")","v":364760},{"$f":"IFERROR(VLOOKUP($C12,'Catchment Demand -LFCF'!$C$8:$J$37,8,FALSE),\"\")","v":36296.82244691869},401056.8224469187,29860388,{"$f":"HLOOKUP(C12,'Future Trunk Assets - LFCF'!$AY$12:$BC$14,3,FALSE)","v":10685018.71248138},40545406.71248138,101.09641438115096,294.37890129659138]
[null,{"$f":"'Catchment Demand -LFCF'!B46","v":4},{"$f":"'Catchment Demand -LFCF'!C46","v":"Urban South"},{"$f":"IFERROR(VLOOKUP($C13,'Catchment Demand -LFCF'!$C$8:$J$37,2,FALSE),\"\")","v":348928},{"$f":"IFERROR(VLOOKUP($C13,'Catchment Demand -LFCF'!$C$8:$J$37,8,FALSE),\"\")","v":34737.03994962381},383665.03994962381,28076946,{"$f":"HLOOKUP(C13,'Future Trunk Assets - LFCF'!$AY$12:$BC$14,3,FALSE)","v":9208230.4604596812},37285176.460459679,97.181584398086727,265.08391255598053]
[null,{"$f":"'Catchment Demand -LFCF'!B47","v":5},{"$f":"'Catchment Demand -LFCF'!C47","v":"Urban West"},{"$f":"IFERROR(VLOOKUP($C14,'Catchment Demand -LFCF'!$C$8:$J$37,2,FALSE),\"\")","v":242606},{"$f":"IFERROR(VLOOKUP($C14,'Catchment Demand -LFCF'!$C$8:$J$37,8,FALSE),\"\")","v":6248.1325137318499},248854.13251373186,24742502,{"$f":"HLOOKUP(C14,'Future Trunk Assets - LFCF'!$AY$12:$BC$14,3,FALSE)","v":4382043.1292608613},29124545.12926086,117.03460511210822,701.33645847462651]
[null,null,"Totals",{"$f":"SUM(D10:D14)","v":1236405},93871.446674071296,1330276.4466740715,108932537,29573284.652604036,138505821.65260404]